Target
Serine/threonine-protein kinase B-raf
Ligand
BDBM333643
Substrate
Meas. Tech.
Competition Binding Assay
Kd
>1000±n/a nM
Citation
 Abraham, SBhagwat, SSCampbell, BTChao, QFaraoni, RHolladay, MWLai, AGRowbottom, MWSetti, ESprankle, KG RAF kinase modulator compounds and methods of use thereof US Patent  US9730937 Publication Date 8/15/2017 
Target
Name:
Serine/threonine-protein kinase B-raf
Synonyms:
B-RAF B-Raf proto-oncogene serine/threonine-protein kinase BRAF1 RAFB1 v-Raf murine sarcoma viral oncogene homolog B1
Type:
Serine/threonine-protein kinase
Mol. Mass.:
84446.00
Organism:
Homo sapiens (Human)
Description:
P15056
Residue:
766
  
Inhibitor
Name:
BDBM333643
Synonyms:
1-[3-(6,7- dimethoxy- quinazolin- 4- ylthio)phenyl]- 3-[1- phenyl-3- (trifluoromethyl)- 1H- pyrazol-5-yl] urea US9730937, Example 339
Type:
Small organic molecule
Emp. Form.:
C27H21F3N6O3S
Mol. Mass.:
566.554
SMILES:
COc1cc2ncnc(Sc3cccc(NC(=O)Nc4cc(nn4-c4ccccc4)C(F)(F)F)c3)c2cc1OC
: