Target
RAF proto-oncogene serine/threonine-protein kinase
Ligand
BDBM333644
Substrate
Meas. Tech.
Competition Binding Assay
Kd
<250±n/a nM
Citation
 Abraham, SBhagwat, SSCampbell, BTChao, QFaraoni, RHolladay, MWLai, AGRowbottom, MWSetti, ESprankle, KG RAF kinase modulator compounds and methods of use thereof US Patent  US9730937 Publication Date 8/15/2017 
Target
Name:
RAF proto-oncogene serine/threonine-protein kinase
Synonyms:
C-Raf Protein Kinase RAF RAF1 Raf-1 Serine/threonine-protein kinase C-Raf | cRaf
Type:
Serine/threonine-protein kinase
Mol. Mass.:
73082.52
Organism:
Homo sapiens (Human)
Description:
P04049
Residue:
648
  
Inhibitor
Name:
BDBM333644
Synonyms:
1-[3-(6,7- dimethoxy- quinazolin- 4- ylthio)phenyl]- 3-[1- methyl-3- (trifluoromethyl)- 1H- pyrazol-5-yl] urea | US9730937, Example 193
Type:
Small organic molecule
Emp. Form.:
C22H19F3N6O3S
Mol. Mass.:
504.485
SMILES:
COc1cc2ncnc(Sc3cccc(NC(=O)Nc4cc(nn4C)C(F)(F)F)c3)c2cc1OC
: