Target
Serine/threonine-protein kinase B-raf [V600E]
Ligand
BDBM333646
Substrate
Meas. Tech.
Competition Binding Assay
Kd
375±n/a nM
Citation
 Abraham, SBhagwat, SSCampbell, BTChao, QFaraoni, RHolladay, MWLai, AGRowbottom, MWSetti, ESprankle, KG RAF kinase modulator compounds and methods of use thereof US Patent  US9730937 Publication Date 8/15/2017 
Target
Name:
Serine/threonine-protein kinase B-raf [V600E]
Synonyms:
B-RAF V600E B-Raf Protein Kinase Mutant (V600E) BRAF BRAF mutant V600E BRAF_HUMAN Protein mono-ADP-ribosyltransferase (PARP3) RAFB1 Serine/threonine-protein kinase B-raf (V600E) V-RAF murine sarcoma viral oncogene homologue B1 mutant (BRAF V600E)
Type:
Mol. Mass.:
84474.98
Organism:
Homo sapiens (Human)
Description:
P15056 V600E
Residue:
766
  
Inhibitor
Name:
BDBM333646
Synonyms:
US9730937, Example 195 | ethyl 2-(3- tert-butyl-5- {3-[3-(6,7- dimethoxy- quinazolin- 4- ylthio)phenyl] ureido}- 1H- pyrazol-1-yl) acetate
Type:
Small organic molecule
Emp. Form.:
C28H32N6O5S
Mol. Mass.:
564.656
SMILES:
CCOC(=O)Cn1nc(cc1NC(=O)Nc1cccc(Sc2ncnc3cc(OC)c(OC)cc23)c1)C(C)(C)C
: