Target
Serine/threonine-protein kinase B-raf
Ligand
BDBM333648
Substrate
Meas. Tech.
Competition Binding Assay
Kd
>1000±n/a nM
Citation
 Abraham, SBhagwat, SSCampbell, BTChao, QFaraoni, RHolladay, MWLai, AGRowbottom, MWSetti, ESprankle, KG RAF kinase modulator compounds and methods of use thereof US Patent  US9730937 Publication Date 8/15/2017 
Target
Name:
Serine/threonine-protein kinase B-raf
Synonyms:
B-RAF B-Raf proto-oncogene serine/threonine-protein kinase BRAF1 RAFB1 v-Raf murine sarcoma viral oncogene homolog B1
Type:
Serine/threonine-protein kinase
Mol. Mass.:
84446.00
Organism:
Homo sapiens (Human)
Description:
P15056
Residue:
766
  
Inhibitor
Name:
BDBM333648
Synonyms:
1-[3-(6,7- dimethoxy- quinazolin- 4- ylthio)phenyl]- 3-[3- (2- ethoxypropan- 2-yl)-1- phenyl-1H- pyrazol-5-yl] urea | US9730937, Example 197
Type:
Small organic molecule
Emp. Form.:
C32H34N6O4S
Mol. Mass.:
598.715
SMILES:
CCCOC(C)(C)c1cc(NC(=O)Nc2cccc(Sc3ncnc4cc(OC)c(OC)cc34)c2)n(n1)-c1ccccc1
: