Target
Serine/threonine-protein kinase B-raf [V600E]
Ligand
BDBM333652
Substrate
Meas. Tech.
Competition Binding Assay
Kd
<250±n/a nM
Citation
 Abraham, SBhagwat, SSCampbell, BTChao, QFaraoni, RHolladay, MWLai, AGRowbottom, MWSetti, ESprankle, KG RAF kinase modulator compounds and methods of use thereof US Patent  US9730937 Publication Date 8/15/2017 
Target
Name:
Serine/threonine-protein kinase B-raf [V600E]
Synonyms:
B-RAF V600E B-Raf Protein Kinase Mutant (V600E) BRAF BRAF mutant V600E BRAF_HUMAN Protein mono-ADP-ribosyltransferase (PARP3) RAFB1 Serine/threonine-protein kinase B-raf (V600E) V-RAF murine sarcoma viral oncogene homologue B1 mutant (BRAF V600E)
Type:
Mol. Mass.:
84474.98
Organism:
Homo sapiens (Human)
Description:
P15056 V600E
Residue:
766
  
Inhibitor
Name:
BDBM333652
Synonyms:
1-(5- cyclopentyl- isoxazol- 3-yl)- 3-(3-(6,7- dimethoxy- quinazolin- 4- ylthio)phenyl) urea | US9730937, Example 201
Type:
Small organic molecule
Emp. Form.:
C25H25N5O4S
Mol. Mass.:
491.562
SMILES:
COc1cc2ncnc(Sc3cccc(NC(=O)Nc4cc(on4)C4CCCC4)c3)c2cc1OC
: