Target
Serine/threonine-protein kinase B-raf
Ligand
BDBM333652
Substrate
Meas. Tech.
Competition Binding Assay
Kd
375±n/a nM
Citation
 Abraham, SBhagwat, SSCampbell, BTChao, QFaraoni, RHolladay, MWLai, AGRowbottom, MWSetti, ESprankle, KG RAF kinase modulator compounds and methods of use thereof US Patent  US9730937 Publication Date 8/15/2017 
Target
Name:
Serine/threonine-protein kinase B-raf
Synonyms:
B-RAF B-Raf proto-oncogene serine/threonine-protein kinase BRAF1 RAFB1 v-Raf murine sarcoma viral oncogene homolog B1
Type:
Serine/threonine-protein kinase
Mol. Mass.:
84446.00
Organism:
Homo sapiens (Human)
Description:
P15056
Residue:
766
  
Inhibitor
Name:
BDBM333652
Synonyms:
1-(5- cyclopentyl- isoxazol- 3-yl)- 3-(3-(6,7- dimethoxy- quinazolin- 4- ylthio)phenyl) urea | US9730937, Example 201
Type:
Small organic molecule
Emp. Form.:
C25H25N5O4S
Mol. Mass.:
491.562
SMILES:
COc1cc2ncnc(Sc3cccc(NC(=O)Nc4cc(on4)C4CCCC4)c3)c2cc1OC
: