Target
Serine/threonine-protein kinase B-raf [V600E]
Ligand
BDBM333653
Substrate
Meas. Tech.
Competition Binding Assay
Kd
<250±n/a nM
Citation
 Abraham, SBhagwat, SSCampbell, BTChao, QFaraoni, RHolladay, MWLai, AGRowbottom, MWSetti, ESprankle, KG RAF kinase modulator compounds and methods of use thereof US Patent  US9730937 Publication Date 8/15/2017 
Target
Name:
Serine/threonine-protein kinase B-raf [V600E]
Synonyms:
B-RAF V600E B-Raf Protein Kinase Mutant (V600E) BRAF BRAF mutant V600E BRAF_HUMAN Protein mono-ADP-ribosyltransferase (PARP3) RAFB1 Serine/threonine-protein kinase B-raf (V600E) V-RAF murine sarcoma viral oncogene homologue B1 mutant (BRAF V600E)
Type:
Mol. Mass.:
84474.98
Organism:
Homo sapiens (Human)
Description:
P15056 V600E
Residue:
766
  
Inhibitor
Name:
BDBM333653
Synonyms:
1-(3-tert- butylisoxazol- 5-yl)-3-(3- (6-methoxy- 7-(2- methoxyethoxy) quinazolin-4- yloxy)phenyl) urea | US9730937, Example 202
Type:
Small organic molecule
Emp. Form.:
C26H29N5O6
Mol. Mass.:
507.5384
SMILES:
COCCOc1cc2ncnc(Oc3cccc(NC(=O)Nc4cc(no4)C(C)(C)C)c3)c2cc1OC
: