Target
RAF proto-oncogene serine/threonine-protein kinase
Ligand
BDBM333653
Substrate
Meas. Tech.
Competition Binding Assay
Kd
375±n/a nM
Citation
 Abraham, SBhagwat, SSCampbell, BTChao, QFaraoni, RHolladay, MWLai, AGRowbottom, MWSetti, ESprankle, KG RAF kinase modulator compounds and methods of use thereof US Patent  US9730937 Publication Date 8/15/2017 
Target
Name:
RAF proto-oncogene serine/threonine-protein kinase
Synonyms:
C-Raf Protein Kinase RAF RAF1 Raf-1 Serine/threonine-protein kinase C-Raf | cRaf
Type:
Serine/threonine-protein kinase
Mol. Mass.:
73082.52
Organism:
Homo sapiens (Human)
Description:
P04049
Residue:
648
  
Inhibitor
Name:
BDBM333653
Synonyms:
1-(3-tert- butylisoxazol- 5-yl)-3-(3- (6-methoxy- 7-(2- methoxyethoxy) quinazolin-4- yloxy)phenyl) urea | US9730937, Example 202
Type:
Small organic molecule
Emp. Form.:
C26H29N5O6
Mol. Mass.:
507.5384
SMILES:
COCCOc1cc2ncnc(Oc3cccc(NC(=O)Nc4cc(no4)C(C)(C)C)c3)c2cc1OC
: