Target
Serine/threonine-protein kinase B-raf [V600E]
Ligand
BDBM333654
Substrate
Meas. Tech.
Competition Binding Assay
Kd
>1000±n/a nM
Citation
 Abraham, SBhagwat, SSCampbell, BTChao, QFaraoni, RHolladay, MWLai, AGRowbottom, MWSetti, ESprankle, KG RAF kinase modulator compounds and methods of use thereof US Patent  US9730937 Publication Date 8/15/2017 
Target
Name:
Serine/threonine-protein kinase B-raf [V600E]
Synonyms:
B-RAF V600E B-Raf Protein Kinase Mutant (V600E) BRAF BRAF mutant V600E BRAF_HUMAN Protein mono-ADP-ribosyltransferase (PARP3) RAFB1 Serine/threonine-protein kinase B-raf (V600E) V-RAF murine sarcoma viral oncogene homologue B1 mutant (BRAF V600E)
Type:
Mol. Mass.:
84474.98
Organism:
Homo sapiens (Human)
Description:
P15056 V600E
Residue:
766
  
Inhibitor
Name:
BDBM333654
Synonyms:
1-(3-(6- Methoxy-7- (2- methoxyethoxy) quinazolin-4- yloxy)phenyl)- 3-(5- phenylisoxazol- 3-yl) urea | US9730937, Example 203
Type:
Small organic molecule
Emp. Form.:
C28H25N5O5S
Mol. Mass.:
543.594
SMILES:
COCCOc1cc2ncnc(Sc3cccc(NC(=O)Nc4cc(on4)-c4ccccc4)c3)c2cc1OC
: