Target
RAF proto-oncogene serine/threonine-protein kinase
Ligand
BDBM333664
Substrate
Meas. Tech.
Competition Binding Assay
Kd
<250±n/a nM
Citation
 Abraham, SBhagwat, SSCampbell, BTChao, QFaraoni, RHolladay, MWLai, AGRowbottom, MWSetti, ESprankle, KG RAF kinase modulator compounds and methods of use thereof US Patent  US9730937 Publication Date 8/15/2017 
Target
Name:
RAF proto-oncogene serine/threonine-protein kinase
Synonyms:
C-Raf Protein Kinase RAF RAF1 Raf-1 Serine/threonine-protein kinase C-Raf | cRaf
Type:
Serine/threonine-protein kinase
Mol. Mass.:
73082.52
Organism:
Homo sapiens (Human)
Description:
P04049
Residue:
648
  
Inhibitor
Name:
BDBM333664
Synonyms:
1-(3- cyclopropyl- isoxazol- 5- yl)-3-(3-(6- methoxy-7- (2- methoxyethoxy) quinazolin-4- yloxy)phenyl) urea | US9730937, Example 214
Type:
Small organic molecule
Emp. Form.:
C25H25N5O6
Mol. Mass.:
491.4959
SMILES:
COCCOc1cc2ncnc(Oc3cccc(NC(=O)Nc4cc(no4)C4CC4)c3)c2cc1OC
: