Target
RAF proto-oncogene serine/threonine-protein kinase
Ligand
BDBM333682
Substrate
Meas. Tech.
Competition Binding Assay
Kd
<250±n/a nM
Citation
 Abraham, SBhagwat, SSCampbell, BTChao, QFaraoni, RHolladay, MWLai, AGRowbottom, MWSetti, ESprankle, KG RAF kinase modulator compounds and methods of use thereof US Patent  US9730937 Publication Date 8/15/2017 
Target
Name:
RAF proto-oncogene serine/threonine-protein kinase
Synonyms:
C-Raf Protein Kinase RAF RAF1 Raf-1 Serine/threonine-protein kinase C-Raf | cRaf
Type:
Serine/threonine-protein kinase
Mol. Mass.:
73082.52
Organism:
Homo sapiens (Human)
Description:
P04049
Residue:
648
  
Inhibitor
Name:
BDBM333682
Synonyms:
1-(5- isopropylisoxazol- 3-yl)- 3-(3-(6- methoxy-7- (2-methoxy- ethoxy) quinazolin-4- ylthio)phenyl)urea | US9730937, Example 232
Type:
Small organic molecule
Emp. Form.:
C25H27N5O5S
Mol. Mass.:
509.577
SMILES:
COCCOc1cc2ncnc(Sc3cccc(NC(=O)Nc4cc(on4)C(C)C)c3)c2cc1OC
: