Target
RAF proto-oncogene serine/threonine-protein kinase
Ligand
BDBM333704
Substrate
Meas. Tech.
Competition Binding Assay
Kd
<250±n/a nM
Citation
 Abraham, SBhagwat, SSCampbell, BTChao, QFaraoni, RHolladay, MWLai, AGRowbottom, MWSetti, ESprankle, KG RAF kinase modulator compounds and methods of use thereof US Patent  US9730937 Publication Date 8/15/2017 
Target
Name:
RAF proto-oncogene serine/threonine-protein kinase
Synonyms:
C-Raf Protein Kinase RAF RAF1 Raf-1 Serine/threonine-protein kinase C-Raf | cRaf
Type:
Serine/threonine-protein kinase
Mol. Mass.:
73082.52
Organism:
Homo sapiens (Human)
Description:
P04049
Residue:
648
  
Inhibitor
Name:
BDBM333704
Synonyms:
1-(3-(6,7- dimethoxy- quinazolin- 4-yloxy)phenyl)- 3- (3- (trifluoromethyl) isoxazol-5- yl)urea | US9730937, Example 254
Type:
Small organic molecule
Emp. Form.:
C21H16F3N5O5
Mol. Mass.:
475.3774
SMILES:
COc1cc2ncnc(Oc3cccc(NC(=O)Nc4cc(no4)C(F)(F)F)c3)c2cc1OC
: