Target
RAF proto-oncogene serine/threonine-protein kinase
Ligand
BDBM333707
Substrate
Meas. Tech.
Competition Binding Assay
Kd
<250±n/a nM
Citation
 Abraham, SBhagwat, SSCampbell, BTChao, QFaraoni, RHolladay, MWLai, AGRowbottom, MWSetti, ESprankle, KG RAF kinase modulator compounds and methods of use thereof US Patent  US9730937 Publication Date 8/15/2017 
Target
Name:
RAF proto-oncogene serine/threonine-protein kinase
Synonyms:
C-Raf Protein Kinase RAF RAF1 Raf-1 Serine/threonine-protein kinase C-Raf | cRaf
Type:
Serine/threonine-protein kinase
Mol. Mass.:
73082.52
Organism:
Homo sapiens (Human)
Description:
P04049
Residue:
648
  
Inhibitor
Name:
BDBM333707
Synonyms:
1-(3-(2- fluoropropan-2- yl)isoxazol-5- yl)-3-(3-(7- hydroxy-6- methoxy- quinazolin- 4-yloxy) phenyl)urea | US9730937, Example 257
Type:
Small organic molecule
Emp. Form.:
C22H20FN5O5
Mol. Mass.:
453.4231
SMILES:
COc1cc2c(Oc3cccc(NC(=O)Nc4cc(no4)C(C)(C)F)c3)ncnc2cc1O
: