Target
Nitric oxide synthase, endothelial
Ligand
BDBM50446250
Substrate
Meas. Tech.
Inhibition Assay
Ki
6927±n/a nM
Citation
 Silverman, RBJing, Q 2-aminopyridine-based selective neuronal nitric oxide synthase inhibitors US Patent  US9732037 Publication Date 8/15/2017 
Target
Name:
Nitric oxide synthase, endothelial
Synonyms:
Constitutive NOS Endothelial NOS NOS type III NOS3_HUMAN Nitric oxide synthase (inducible and endothelial) Nitric-oxide synthase (endothelial and brain) eNOS
Type:
Enzyme Catalytic Domain
Mol. Mass.:
133297.84
Organism:
Homo sapiens (Human)
Description:
P29474
Residue:
1203
  
Inhibitor
Name:
BDBM50446250
Synonyms:
CHEMBL3109188 | US9732037, Compound 9
Type:
Small organic molecule
Emp. Form.:
C19H27N5O2
Mol. Mass.:
357.45
SMILES:
Cc1cc(N)nc(COC[C@H]2C[C@@H](CN2)OCc2cc(C)cc(N)n2)c1
: