Target
Nitric oxide synthase, brain
Ligand
BDBM50446245
Substrate
Meas. Tech.
Inhibition Assay
Ki
330±n/a nM
Citation
 Silverman, RBJing, Q 2-aminopyridine-based selective neuronal nitric oxide synthase inhibitors US Patent  US9732037 Publication Date 8/15/2017 
Target
Name:
Nitric oxide synthase, brain
Synonyms:
Constitutive NOS NC-NOS NOS type I nNOS NOS1_HUMAN Neuronal nitric oxide synthase Nitric oxide synthase, neuronal (nNOS) bNOS | nNOS
Type:
Homodimer
Mol. Mass.:
160985.98
Organism:
Homo sapiens (Human)
Description:
P29475
Residue:
1434
  
Inhibitor
Name:
BDBM50446245
Synonyms:
CHEMBL3109193 | US9732037, Compound 13
Type:
Small organic molecule
Emp. Form.:
C21H28FN3O3
Mol. Mass.:
389.4637
SMILES:
Cc1cc(N)nc(CO[C@H]2CN[C@@H](COCCOCc3cccc(F)c3)C2)c1
: