Target
Nitric oxide synthase, brain
Ligand
BDBM50441007
Substrate
Meas. Tech.
Inhibition Assay
Ki
47.0±n/a nM
Citation
 Silverman, RBJing, Q 2-aminopyridine-based selective neuronal nitric oxide synthase inhibitors US Patent  US9732037 Publication Date 8/15/2017 
Target
Name:
Nitric oxide synthase, brain
Synonyms:
Constitutive NOS NC-NOS NOS type I nNOS NOS1_HUMAN Neuronal nitric oxide synthase Nitric oxide synthase, neuronal (nNOS) bNOS | nNOS
Type:
Homodimer
Mol. Mass.:
160985.98
Organism:
Homo sapiens (Human)
Description:
P29475
Residue:
1434
  
Inhibitor
Name:
BDBM50441007
Synonyms:
CHEMBL2430149 | US9732037, Compound 19
Type:
Small organic molecule
Emp. Form.:
C18H27N5O2
Mol. Mass.:
345.4393
SMILES:
C[C@@H](OCc1cc(C)cc(N)n1)[C@H](N)COCc1cc(C)cc(N)n1
: