Target
P2X purinoceptor 3
Ligand
BDBM271521
Substrate
Meas. Tech.
Receptor Inhibition Assay
IC50
4.00±n/a nM
Citation
 Kai, H Aminotriazine derivative and pharmaceutical composition comprising the same US Patent  US9732060 Publication Date 8/15/2017 
Target
Name:
P2X purinoceptor 3
Synonyms:
ATP receptor P2RX3 P2X purinoceptor 3 P2X purinoceptor 3 (P2X3) P2X3 purinoceptor p2x3 + hsa
Type:
Protein
Mol. Mass.:
44292.02
Organism:
Homo sapiens (Human)
Description:
P56373
Residue:
397
  
Inhibitor
Name:
BDBM271521
Synonyms:
US10065941, Compound I-022 | US9732060, Compound I-022
Type:
Small organic molecule
Emp. Form.:
C26H22ClF2N5O6
Mol. Mass.:
573.933
SMILES:
C[C@@H](Cn1c(=O)[nH]\c(=N/c2ccc(Oc3ccc(OC(F)F)cn3)cc2)n(Cc2ccc(Cl)cc2)c1=O)C(O)=O
: