Target
Tyrosine-protein kinase SYK
Ligand
BDBM334337
Substrate
Meas. Tech.
Enzyme Inhibition Assay
IC50
72.0±n/a nM
Citation
 Frickel, FFyfe, MCMeghani, PThom, SM Kinase inhibitors US Patent  US9732063 Publication Date 8/15/2017 
Target
Name:
Tyrosine-protein kinase SYK
Synonyms:
KSYK_HUMAN Spleen Tyrosine Kinase Tyrosine-protein kinase SYK (Syk)
Type:
Enzyme
Mol. Mass.:
72079.99
Organism:
Homo sapiens (Human)
Description:
P43405
Residue:
635
  
Inhibitor
Name:
BDBM334337
Synonyms:
1-(2,3-Dichloro-4-((2-((3-methoxy-5-(2-morpholinoethoxyl)phenyl)amino)pyrimidin-4-yl)-oxy)phenyl)-3-(3-isopropyl-1-(p-tolyl)-1H-pyrazol-5-yl)urea | US9732063, Example 21
Type:
Small organic molecule
Emp. Form.:
C37H40Cl2N8O5
Mol. Mass.:
747.67
SMILES:
COc1cc(Nc2nccc(Oc3ccc(NC(=O)Nc4cc(nn4-c4ccc(C)cc4)C(C)C)c(Cl)c3Cl)n2)cc(OCCN2CCOCC2)c1
: