Target
Glycogen synthase kinase-3 alpha
Ligand
BDBM334337
Substrate
Meas. Tech.
Enzyme Inhibition Assay
IC50
>10000±n/a nM
Citation
 Frickel, FFyfe, MCMeghani, PThom, SM Kinase inhibitors US Patent  US9732063 Publication Date 8/15/2017 
Target
Name:
Glycogen synthase kinase-3 alpha
Synonyms:
GSK-3 alpha GSK3A_HUMAN Glycogen synthase kinase-3 Glycogen synthase kinase-3 alpha (GSK3 Alpha) Glycogen synthase kinase-3 alpha (GSK3alpha)
Type:
Enzyme
Mol. Mass.:
50991.79
Organism:
Homo sapiens (Human)
Description:
P49840
Residue:
483
  
Inhibitor
Name:
BDBM334337
Synonyms:
1-(2,3-Dichloro-4-((2-((3-methoxy-5-(2-morpholinoethoxyl)phenyl)amino)pyrimidin-4-yl)-oxy)phenyl)-3-(3-isopropyl-1-(p-tolyl)-1H-pyrazol-5-yl)urea | US9732063, Example 21
Type:
Small organic molecule
Emp. Form.:
C37H40Cl2N8O5
Mol. Mass.:
747.67
SMILES:
COc1cc(Nc2nccc(Oc3ccc(NC(=O)Nc4cc(nn4-c4ccc(C)cc4)C(C)C)c(Cl)c3Cl)n2)cc(OCCN2CCOCC2)c1
: