Target
Tyrosine-protein kinase SYK
Ligand
BDBM334353
Substrate
Meas. Tech.
Enzyme Inhibition Assay
IC50
36.0±n/a nM
Citation
 Frickel, FFyfe, MCMeghani, PThom, SM Kinase inhibitors US Patent  US9732063 Publication Date 8/15/2017 
Target
Name:
Tyrosine-protein kinase SYK
Synonyms:
KSYK_HUMAN Spleen Tyrosine Kinase Tyrosine-protein kinase SYK (Syk)
Type:
Enzyme
Mol. Mass.:
72079.99
Organism:
Homo sapiens (Human)
Description:
P43405
Residue:
635
  
Inhibitor
Name:
BDBM334353
Synonyms:
1-(3-(tert-Butyl)-1-(p-tolyl)-1H-pyrazol-5-yl)-3-(4-((2-((3-methoxy-5-(2-(2-(2-methoxy-ethoxy)ethoxy)ethoxy)phenyl)amino)pyrimidin-4-yl)oxy)naphthalen-1-yl)urea | US9732063, Example 37
Type:
Small organic molecule
Emp. Form.:
C43H49N7O7
Mol. Mass.:
775.8919
SMILES:
COCCOCCOCCOc1cc(Nc2nccc(Oc3ccc(NC(=O)Nc4cc(nn4-c4ccc(C)cc4)C(C)(C)C)c4ccccc34)n2)cc(OC)c1
: