Target
Orexin receptor type 2
Ligand
BDBM334950
Substrate
Meas. Tech.
Inhibition Assay
IC50
18.0±n/a nM
Citation
 Boss, CBrotschi, CGude, MHeidmann, BSifferlen, TWilliams, J Benzimidazole-proline derivatives US Patent  US9732075 Publication Date 8/15/2017 
Target
Name:
Orexin receptor type 2
Synonyms:
HCRTR2 OX2R_HUMAN Orexin receptor type 2 (OR-2) Orexin receptor type 2 (OX2R) Ox-2-R | Ox2-R
Type:
Protein
Mol. Mass.:
50710.53
Organism:
Homo sapiens (Human)
Description:
O43614
Residue:
444
  
Inhibitor
Name:
BDBM334950
Synonyms:
US11040966, Example 5.21 US9914721, Ex. 4 | [(S)-2-(5,6-Dimethoxy-1H-benzoimidazol-2-yl)-2-methyl-pyrrolidin-1-yl]-(5-methyl-2-[1,2,3]triazol-2-yl-phenyl)-methanone
Type:
Small organic molecule
Emp. Form.:
C24H26N6O3
Mol. Mass.:
446.5016
SMILES:
COc1cc2nc([nH]c2cc1OC)[C@]1(C)CCCN1C(=O)c1cc(C)ccc1-n1nccn1
: