Target
Beta-secretase 2
Ligand
BDBM335448
Substrate
Meas. Tech.
BACE-2 Assay
Ki
7.50±n/a nM
Citation
 Walsh, SPCumming, JNHe, STaoka, BMTruong, QTWu, W C2-carbocyclic iminothiazine dioxides as BACE inhibitors, compositions, and their use US Patent  US9732088 Publication Date 8/15/2017 
Target
Name:
Beta-secretase 2
Synonyms:
AEPLC ASP1 Asp 1 Aspartyl protease 1 BACE2_HUMAN Beta-secretase (BACE) Beta-secretase 2 (BACE-2) Beta-site APP-cleaving enzyme 2 Memapsin-1 beta-Secretase (BACE-2)
Type:
Protein
Mol. Mass.:
56171.20
Organism:
Homo sapiens (Human)
Description:
Q9Y5Z0
Residue:
518
  
Inhibitor
Name:
BDBM335448
Synonyms:
(3R,6S)-5-amino-3-(5-((3-(but- 2-yn-1-yloxy)-1,7-naphthyridin- 8-yl)amino)-2-fluoropyridin-3- yl)-6-cyclopropyl-6- (fluoromethyl)-3-methyl-3,6- dihydro-2H-1,4-thiazine 1,1- dioxide | US9732088, Example 11
Type:
Small organic molecule
Emp. Form.:
C26H26F2N6O3S
Mol. Mass.:
540.585
SMILES:
CC#CCOc1cnc2c(Nc3cnc(F)c(c3)[C@]3(C)CS(=O)(=O)[C@@](CF)(C4CC4)C(N)=N3)nccc2c1
: