Target
Beta-secretase 2
Ligand
BDBM335463
Substrate
Meas. Tech.
BACE-2 Assay
Ki
11.0±n/a nM
Citation
 Walsh, SPCumming, JNHe, STaoka, BMTruong, QTWu, W C2-carbocyclic iminothiazine dioxides as BACE inhibitors, compositions, and their use US Patent  US9732088 Publication Date 8/15/2017 
Target
Name:
Beta-secretase 2
Synonyms:
AEPLC ASP1 Asp 1 Aspartyl protease 1 BACE2_HUMAN Beta-secretase (BACE) Beta-secretase 2 (BACE-2) Beta-site APP-cleaving enzyme 2 Memapsin-1 beta-Secretase (BACE-2)
Type:
Protein
Mol. Mass.:
56171.20
Organism:
Homo sapiens (Human)
Description:
Q9Y5Z0
Residue:
518
  
Inhibitor
Name:
BDBM335463
Synonyms:
(3R,6S)-5-amino-6- cyclopropyl-3-(2-fluoro-5-((7- methoxypteridin-4- yl)amino)phenyl)-3,6-dimethyl- 3,6-dihydro-2H-1,4-thiazine 1,1-dioxide | US9732088, Example 22
Type:
Small organic molecule
Emp. Form.:
C22H24FN7O3S
Mol. Mass.:
485.534
SMILES:
COc1cnc2c(Nc3ccc(F)c(c3)[C@]3(C)CS(=O)(=O)[C@@](C)(C4CC4)C(N)=N3)ncnc2n1
: