Target
Potassium voltage-gated channel subfamily H member 2
Ligand
BDBM315579
Substrate
Meas. Tech.
Patch Clamp Assay
Ki
12500±n/a nM
Citation
 Fuchss, TEmde, UBuchstaller, HMederski, W Arylquinazolines US Patent  US9732094 Publication Date 8/15/2017 
Target
Name:
Potassium voltage-gated channel subfamily H member 2
Synonyms:
1,3-beta-glucan synthase component GLS2 ERG Eag-related protein 1 Ether-a-go-go-related gene (HERG) Ether-a-go-go-related gene potassium channel 1 Ether-a-go-go-related gene potassium channel 1 (hERG1) Ether-a-go-go-related protein 1 H-ERG KCNH2 Potassium voltage-gated channel subfamily H member 2 (hERG) Voltage-gated potassium channel subunit Kv11.1 hERG Potassium Channel 1 | putative potassium channel subunit
Type:
Multi-pass membrane protein
Mol. Mass.:
126672.65
Organism:
Homo sapiens (Human)
Description:
Q12809
Residue:
1159
  
Inhibitor
Name:
BDBM315579
Synonyms:
US10172859, Example 6 US9732094, Example 6 | [2-Chloro-4-fluoro-5-(7- morpholin-4-yl- quinazolin-4-yl)phenyl]- (6-chloro-5-methoxy- pyridazin-3-yl) methanol1H NMR (500 MHz, DMSO-d6) ppm = 9.07 (s, 1H), 7.75 (d, J = 1.0, 1H), 7.72 (d, J = 9.5, 1H), 7.56 (d, J = 7.6, 1H), 7.51 (dd, J = 9.5, 2.5, 1H), 7.47 (dd, J = 9.4, 2.9, 1H), 7.19 (d, J = 2.4, 1H), 6.59 (d, J = 5.0, 1H), 6.13-6.10 (m, 1H), 3.98 (s, 3H), 3.80-3.74 (m, 4H), 3.48-3.41 (m, 4H)
Type:
Small organic molecule
Emp. Form.:
C24H20Cl2FN5O3
Mol. Mass.:
516.352
SMILES:
COc1nnc(Cl)cc1C(O)c1cc(c(F)cc1Cl)-c1ncnc2cc(ccc12)N1CCOCC1
: