Target
Potassium voltage-gated channel subfamily H member 2
Ligand
BDBM315596
Substrate
Meas. Tech.
Patch Clamp Assay
Ki
<10000±n/a nM
Citation
 Fuchss, TEmde, UBuchstaller, HMederski, W Arylquinazolines US Patent  US9732094 Publication Date 8/15/2017 
Target
Name:
Potassium voltage-gated channel subfamily H member 2
Synonyms:
1,3-beta-glucan synthase component GLS2 ERG Eag-related protein 1 Ether-a-go-go-related gene (HERG) Ether-a-go-go-related gene potassium channel 1 Ether-a-go-go-related gene potassium channel 1 (hERG1) Ether-a-go-go-related protein 1 H-ERG KCNH2 Potassium voltage-gated channel subfamily H member 2 (hERG) Voltage-gated potassium channel subunit Kv11.1 hERG Potassium Channel 1 | putative potassium channel subunit
Type:
Multi-pass membrane protein
Mol. Mass.:
126672.65
Organism:
Homo sapiens (Human)
Description:
Q12809
Residue:
1159
  
Inhibitor
Name:
BDBM315596
Synonyms:
(2-Chloro-5-methoxy- pyridin-3-yl)-[4-fluoro-3- (7-morpholin-4-yl- quinazolin-4-yl)phenyl]- methanol1H NMR (500 MHz, DMSO-d6) ppm = 9.09 (s, 1H), 8.28 (d, J = 2.6, 1H), 7.62-7.55 (m, 3H), 7.55- 7.49 (m, 2H), 7.41-7.32 (m, 1H), 7.21-7.18 (m, 1H), 6.16 (d, J = 6.1, 1H), 6.03 (d, J = 6.1, 1H), 3.85 (s, 3H), 3.80-3.75 (m, 4H), 3.47-3.42 (m, 4H) US11065253, Example 22 | US9732094, Example 22
Type:
Small organic molecule
Emp. Form.:
C25H22ClFN4O3
Mol. Mass.:
480.919
SMILES:
COc1cnc(Cl)c(c1)C(O)c1ccc(F)c(c1)-c1ncnc2cc(ccc12)N1CCOCC1
: