Target
Potassium voltage-gated channel subfamily H member 2
Ligand
BDBM315614
Substrate
Meas. Tech.
Patch Clamp Assay
Ki
12500±n/a nM
Citation
 Fuchss, TEmde, UBuchstaller, HMederski, W Arylquinazolines US Patent  US9732094 Publication Date 8/15/2017 
Target
Name:
Potassium voltage-gated channel subfamily H member 2
Synonyms:
1,3-beta-glucan synthase component GLS2 ERG Eag-related protein 1 Ether-a-go-go-related gene (HERG) Ether-a-go-go-related gene potassium channel 1 Ether-a-go-go-related gene potassium channel 1 (hERG1) Ether-a-go-go-related protein 1 H-ERG KCNH2 Potassium voltage-gated channel subfamily H member 2 (hERG) Voltage-gated potassium channel subunit Kv11.1 hERG Potassium Channel 1 | putative potassium channel subunit
Type:
Multi-pass membrane protein
Mol. Mass.:
126672.65
Organism:
Homo sapiens (Human)
Description:
Q12809
Residue:
1159
  
Inhibitor
Name:
BDBM315614
Synonyms:
US10172859, Example 40 US9732094, Example 40 | [2-Chloro-4-fluoro-5-(7- morpholin-4-yl- quinazolin-4-yl)phenyl]- (4-methoxypyrido- [3,4-d}pyridazin-1-yl)- methanol1H NMR (400 MHz, DMSO-d6) ppm = 9.97 (s, 1H), 9.15 (s, 1H), 9.11 (d, J = 5.5, 1H), 8.10-8.02 (m, 2H), 7.73-7.62 (m, 2H), 7.57 (dd, J = 9.5, 2.5, 1H), 7.23 (d, J = 2.4, 1H), 6.95-6.87 (m, 2H), 4.18 (s, 3H), 3.84-3.74 (m, 4H), 3.52-3.41 (m, 4H)
Type:
Small organic molecule
Emp. Form.:
C27H22ClFN6O3
Mol. Mass.:
532.953
SMILES:
COc1nnc(C(O)c2cc(c(F)cc2Cl)-c2ncnc3cc(ccc23)N2CCOCC2)c2ccncc12
: