Target
Potassium voltage-gated channel subfamily H member 2
Ligand
BDBM315696
Substrate
Meas. Tech.
Patch Clamp Assay
Ki
<10000±n/a nM
Citation
 Fuchss, TEmde, UBuchstaller, HMederski, W Arylquinazolines US Patent  US9732094 Publication Date 8/15/2017 
Target
Name:
Potassium voltage-gated channel subfamily H member 2
Synonyms:
1,3-beta-glucan synthase component GLS2 ERG Eag-related protein 1 Ether-a-go-go-related gene (HERG) Ether-a-go-go-related gene potassium channel 1 Ether-a-go-go-related gene potassium channel 1 (hERG1) Ether-a-go-go-related protein 1 H-ERG KCNH2 Potassium voltage-gated channel subfamily H member 2 (hERG) Voltage-gated potassium channel subunit Kv11.1 hERG Potassium Channel 1 | putative potassium channel subunit
Type:
Multi-pass membrane protein
Mol. Mass.:
126672.65
Organism:
Homo sapiens (Human)
Description:
Q12809
Residue:
1159
  
Inhibitor
Name:
BDBM315696
Synonyms:
US10172859, Example 120 US9732094, Example 120 | [2,4-Difluoro-5-(7- morpholin-4-yl- quinazolin-4-yl)- phenyl]-(4- methoxyphenyl)- methanol1H NMR (400 MHz, DMSO-d6) ppm = 9.09 (s,1H), 7.61-7.47 (m, 3H), 7.36-7.30 (m, 2H),7.27 (t, J = 9.1, 1H), 7.20 (d, J = 2.3, 1H), 6.93-6.87 (m, 2H), 6.18 (d, J = 4.6, 1H), 6.14 (d,J = 4.6, 1H), 3.81-3.75 (m, 4H), 3.73 (s, 3H),3.48-3.41 (m, 4H)
Type:
Small organic molecule
Emp. Form.:
C26H23F2N3O3
Mol. Mass.:
463.4759
SMILES:
COc1ccc(cc1)C(O)c1cc(c(F)cc1F)-c1ncnc2cc(ccc12)N1CCOCC1
: