Target
Potassium voltage-gated channel subfamily H member 2
Ligand
BDBM315700
Substrate
Meas. Tech.
Patch Clamp Assay
Ki
<10000±n/a nM
Citation
 Fuchss, TEmde, UBuchstaller, HMederski, W Arylquinazolines US Patent  US9732094 Publication Date 8/15/2017 
Target
Name:
Potassium voltage-gated channel subfamily H member 2
Synonyms:
1,3-beta-glucan synthase component GLS2 ERG Eag-related protein 1 Ether-a-go-go-related gene (HERG) Ether-a-go-go-related gene potassium channel 1 Ether-a-go-go-related gene potassium channel 1 (hERG1) Ether-a-go-go-related protein 1 H-ERG KCNH2 Potassium voltage-gated channel subfamily H member 2 (hERG) Voltage-gated potassium channel subunit Kv11.1 hERG Potassium Channel 1 | putative potassium channel subunit
Type:
Multi-pass membrane protein
Mol. Mass.:
126672.65
Organism:
Homo sapiens (Human)
Description:
Q12809
Residue:
1159
  
Inhibitor
Name:
BDBM315700
Synonyms:
US10172859, Example 124 US9732094, Example 124 | [2,4-Difluoro-5-(7- morpholin-4-yl- quinazolin-4-yl)- phenyl]-(2-fluoro- 4-methoxy- phenyl)methanol1H NMR (400 MHz, DMSO-d6) ppm = 9.09 (s,1H), 7.70 (t, J = 8.8, 1H), 7.62-7.44 (m, 3H),7.25 (t, J = 9.2, 1H), 7.20 (d, J = 2.4, 1H), 6.82(dd, J = 8.6, 2.5, 1H), 6.74 (dd, J = 12.6, 2.5,1H), 6.34 (d, J = 4.6, 1H), 6.28 (d, J = 4.6, 1H),3.82-3.71 (m, 7H), 3.49-3.41 (m, 4H)
Type:
Small organic molecule
Emp. Form.:
C26H22F3N3O3
Mol. Mass.:
481.4664
SMILES:
COc1ccc(C(O)c2cc(c(F)cc2F)-c2ncnc3cc(ccc23)N2CCOCC2)c(F)c1
: