Target
Potassium voltage-gated channel subfamily H member 2
Ligand
BDBM315721
Substrate
Meas. Tech.
Patch Clamp Assay
Ki
<10000±n/a nM
Citation
 Fuchss, TEmde, UBuchstaller, HMederski, W Arylquinazolines US Patent  US9732094 Publication Date 8/15/2017 
Target
Name:
Potassium voltage-gated channel subfamily H member 2
Synonyms:
1,3-beta-glucan synthase component GLS2 ERG Eag-related protein 1 Ether-a-go-go-related gene (HERG) Ether-a-go-go-related gene potassium channel 1 Ether-a-go-go-related gene potassium channel 1 (hERG1) Ether-a-go-go-related protein 1 H-ERG KCNH2 Potassium voltage-gated channel subfamily H member 2 (hERG) Voltage-gated potassium channel subunit Kv11.1 hERG Potassium Channel 1 | putative potassium channel subunit
Type:
Multi-pass membrane protein
Mol. Mass.:
126672.65
Organism:
Homo sapiens (Human)
Description:
Q12809
Residue:
1159
  
Inhibitor
Name:
BDBM315721
Synonyms:
US10172859, Example 142 US9732094, Example 142 | [2-Chloro-4-fluoro- 5-(7-morpholin-4-yl- quinazolin-4-yl)- phenyl]-(4- hydroxymethyl- thiazol-2-yl)- methanol1H NMR (400 MHz, DMSO-d6) ppm = 9.10 (s,1H), 7.75-7.69 (m, 2H), 7.59-7.49 (m, 2H),7.36 (t, J = 1.1, 1H), 7.23-7.17 (m, 1H), 7.00(d, J = 5.1, 1H), 6.27 (d, J = 5.0, 1H), 5.24 (t,J = 5.7, 1H), 4.52-4.45 (m, 2H), 3.81-3.74 (m,4H), 3.49-3.41 (m, 4H)
Type:
Small organic molecule
Emp. Form.:
C23H20ClFN4O3S
Mol. Mass.:
486.946
SMILES:
OCc1csc(n1)C(O)c1cc(c(F)cc1Cl)-c1ncnc2cc(ccc12)N1CCOCC1
: