Target
Potassium voltage-gated channel subfamily H member 2
Ligand
BDBM315738
Substrate
Meas. Tech.
Patch Clamp Assay
Ki
<10000±n/a nM
Citation
 Fuchss, TEmde, UBuchstaller, HMederski, W Arylquinazolines US Patent  US9732094 Publication Date 8/15/2017 
Target
Name:
Potassium voltage-gated channel subfamily H member 2
Synonyms:
1,3-beta-glucan synthase component GLS2 ERG Eag-related protein 1 Ether-a-go-go-related gene (HERG) Ether-a-go-go-related gene potassium channel 1 Ether-a-go-go-related gene potassium channel 1 (hERG1) Ether-a-go-go-related protein 1 H-ERG KCNH2 Potassium voltage-gated channel subfamily H member 2 (hERG) Voltage-gated potassium channel subunit Kv11.1 hERG Potassium Channel 1 | putative potassium channel subunit
Type:
Multi-pass membrane protein
Mol. Mass.:
126672.65
Organism:
Homo sapiens (Human)
Description:
Q12809
Residue:
1159
  
Inhibitor
Name:
BDBM315738
Synonyms:
2,2,2-Trifluoro-1-[3- (7-morpholin-4-yl- quinazolin-4-yl)- phenyl]-1-thiazol-2- ylethanol1H NMR (500 MHz, DMSO-d6) ppm = 9.08 (s,1H), 8.54 (s, 1H), 8.15-8.13 (m, 1H), 7.98-7.95 (m, 1H), 7.94 (d, J = 3.3, 1H), 7.87 (d,J = 3.2, 1H), 7.83-7.79 (m, 2H), 7.67 (t, J = 7.8,1H), 7.53 (dd, J = 9.5, 2.6, 1H), 7.21 (d, J = 2.6,1H), 3.80-3.76 (m, 4H), 3.47-3.43 (m, 4H) US10172859, Example 172 US11065253, Example 173 | US9732094, Example 173
Type:
Small organic molecule
Emp. Form.:
C23H19F3N4O2S
Mol. Mass.:
472.483
SMILES:
OC(c1nccs1)(c1cccc(c1)-c1ncnc2cc(ccc12)N1CCOCC1)C(F)(F)F
: