Target
Potassium voltage-gated channel subfamily H member 2
Ligand
BDBM315765
Substrate
Meas. Tech.
Patch Clamp Assay
Ki
<10000±n/a nM
Citation
 Fuchss, TEmde, UBuchstaller, HMederski, W Arylquinazolines US Patent  US9732094 Publication Date 8/15/2017 
Target
Name:
Potassium voltage-gated channel subfamily H member 2
Synonyms:
1,3-beta-glucan synthase component GLS2 ERG Eag-related protein 1 Ether-a-go-go-related gene (HERG) Ether-a-go-go-related gene potassium channel 1 Ether-a-go-go-related gene potassium channel 1 (hERG1) Ether-a-go-go-related protein 1 H-ERG KCNH2 Potassium voltage-gated channel subfamily H member 2 (hERG) Voltage-gated potassium channel subunit Kv11.1 hERG Potassium Channel 1 | putative potassium channel subunit
Type:
Multi-pass membrane protein
Mol. Mass.:
126672.65
Organism:
Homo sapiens (Human)
Description:
Q12809
Residue:
1159
  
Inhibitor
Name:
BDBM315765
Synonyms:
(R)-[2-Chloro-4- fluoro-5-(7- morpholin-4-yl- quinazolin-4-yl)- phenyl]-(4- hydroxymethyl- thiazol-2-yl)- methanol1H NMR (500 MHz, DMSO-d6) ppm = 9.10 (s,1H), 7.73 (dd, J = 8.6, 4.5, 2H), 7.57-7.52 (m,2H), 7.38-7.35 (m, 1H), 7.22-7.19 (m, 1H),7.03 (d, J = 5.0, 1H), 6.27 (d, J = 5.0, 1H), 5.27(t, J = 5.7, 1H), 4.50-4.46 (m, 2H), 3.80-3.74(m, 4H), 3.48-3.42 (m, 4H) US11065253, Example 186 | US9732094, Example 186
Type:
Small organic molecule
Emp. Form.:
C23H20ClFN4O3S
Mol. Mass.:
486.946
SMILES:
OCc1csc(n1)[C@H](O)c1cc(c(F)cc1Cl)-c1ncnc2cc(ccc12)N1CCOCC1
: