Target
Potassium voltage-gated channel subfamily H member 2
Ligand
BDBM315775
Substrate
Meas. Tech.
Patch Clamp Assay
Ki
<10000±n/a nM
Citation
 Fuchss, TEmde, UBuchstaller, HMederski, W Arylquinazolines US Patent  US9732094 Publication Date 8/15/2017 
Target
Name:
Potassium voltage-gated channel subfamily H member 2
Synonyms:
1,3-beta-glucan synthase component GLS2 ERG Eag-related protein 1 Ether-a-go-go-related gene (HERG) Ether-a-go-go-related gene potassium channel 1 Ether-a-go-go-related gene potassium channel 1 (hERG1) Ether-a-go-go-related protein 1 H-ERG KCNH2 Potassium voltage-gated channel subfamily H member 2 (hERG) Voltage-gated potassium channel subunit Kv11.1 hERG Potassium Channel 1 | putative potassium channel subunit
Type:
Multi-pass membrane protein
Mol. Mass.:
126672.65
Organism:
Homo sapiens (Human)
Description:
Q12809
Residue:
1159
  
Inhibitor
Name:
BDBM315775
Synonyms:
US10172859, Example 197 US9732094, Example 197 | [4-Fluoro-3-(7- morpholin-4-yl- quinazolin-4-yl)- phenyl]-(1- isopropyl-1H- pyrazol-4-yl)- methanol1H NMR (500 MHz, DMSO-d6) ppm = 9.10 (s,1H), 7.64-7.60 (m, 1H), 7.60-7.57 (m, 2H),7.56-7.50 (m, 2H), 7.41-7.35 (m, 1H), 7.28(s, 1H), 7.20 (d, J = 2.2, 1H), 5.76 (s, 2H), 4.42(h, J = 6.6, 1H), 3.80-3.76 (m, 4H), 3.46-3.42(m, 4H), 1.36 (d, J = 6.7, 6H)
Type:
Small organic molecule
Emp. Form.:
C25H26FN5O2
Mol. Mass.:
447.5046
SMILES:
CC(C)n1cc(cn1)C(O)c1ccc(F)c(c1)-c1ncnc2cc(ccc12)N1CCOCC1
: