Target
Potassium voltage-gated channel subfamily H member 2
Ligand
BDBM315786
Substrate
Meas. Tech.
Patch Clamp Assay
Ki
<10000±n/a nM
Citation
 Fuchss, TEmde, UBuchstaller, HMederski, W Arylquinazolines US Patent  US9732094 Publication Date 8/15/2017 
Target
Name:
Potassium voltage-gated channel subfamily H member 2
Synonyms:
1,3-beta-glucan synthase component GLS2 ERG Eag-related protein 1 Ether-a-go-go-related gene (HERG) Ether-a-go-go-related gene potassium channel 1 Ether-a-go-go-related gene potassium channel 1 (hERG1) Ether-a-go-go-related protein 1 H-ERG KCNH2 Potassium voltage-gated channel subfamily H member 2 (hERG) Voltage-gated potassium channel subunit Kv11.1 hERG Potassium Channel 1 | putative potassium channel subunit
Type:
Multi-pass membrane protein
Mol. Mass.:
126672.65
Organism:
Homo sapiens (Human)
Description:
Q12809
Residue:
1159
  
Inhibitor
Name:
BDBM315786
Synonyms:
US10172859, Example 208 US10172859, Example 216 US9732094, Example 216 | [3-(2-Ethynyl-7-morpholinylquinazolin-4-yl)-4-fluorophenyl]thiazol-2-ylmethanol (EXAMPLE 208)
Type:
Small organic molecule
Emp. Form.:
C24H19FN4O2S
Mol. Mass.:
446.497
SMILES:
OC(c1nccs1)c1ccc(F)c(c1)-c1nc(nc2cc(ccc12)N1CCOCC1)C#C
: