Target
Potassium voltage-gated channel subfamily H member 2
Ligand
BDBM315872
Substrate
Meas. Tech.
Patch Clamp Assay
Ki
<10000±n/a nM
Citation
 Fuchss, TEmde, UBuchstaller, HMederski, W Arylquinazolines US Patent  US9732094 Publication Date 8/15/2017 
Target
Name:
Potassium voltage-gated channel subfamily H member 2
Synonyms:
1,3-beta-glucan synthase component GLS2 ERG Eag-related protein 1 Ether-a-go-go-related gene (HERG) Ether-a-go-go-related gene potassium channel 1 Ether-a-go-go-related gene potassium channel 1 (hERG1) Ether-a-go-go-related protein 1 H-ERG KCNH2 Potassium voltage-gated channel subfamily H member 2 (hERG) Voltage-gated potassium channel subunit Kv11.1 hERG Potassium Channel 1 | putative potassium channel subunit
Type:
Multi-pass membrane protein
Mol. Mass.:
126672.65
Organism:
Homo sapiens (Human)
Description:
Q12809
Residue:
1159
  
Inhibitor
Name:
BDBM315872
Synonyms:
2-[4-Fluoro-3-(7- morpholin-4-yl- quinazolin-4-yl)- phenyl]-2-pyrrolo- [2,1-f][1,2,4]triazin-4- ylacetamide US11065253, Example 299 | US9732094, Example 299
Type:
Small organic molecule
Emp. Form.:
C26H22FN7O2
Mol. Mass.:
483.497
SMILES:
NC(=O)C(c1ccc(F)c(c1)-c1ncnc2cc(ccc12)N1CCOCC1)c1ncnn2cccc12
: