Target
Potassium voltage-gated channel subfamily H member 2
Ligand
BDBM315921
Substrate
Meas. Tech.
Patch Clamp Assay
Ki
<10000±n/a nM
Citation
 Fuchss, TEmde, UBuchstaller, HMederski, W Arylquinazolines US Patent  US9732094 Publication Date 8/15/2017 
Target
Name:
Potassium voltage-gated channel subfamily H member 2
Synonyms:
1,3-beta-glucan synthase component GLS2 ERG Eag-related protein 1 Ether-a-go-go-related gene (HERG) Ether-a-go-go-related gene potassium channel 1 Ether-a-go-go-related gene potassium channel 1 (hERG1) Ether-a-go-go-related protein 1 H-ERG KCNH2 Potassium voltage-gated channel subfamily H member 2 (hERG) Voltage-gated potassium channel subunit Kv11.1 hERG Potassium Channel 1 | putative potassium channel subunit
Type:
Multi-pass membrane protein
Mol. Mass.:
126672.65
Organism:
Homo sapiens (Human)
Description:
Q12809
Residue:
1159
  
Inhibitor
Name:
BDBM315921
Synonyms:
US10172859, Example 345 US9732094, Example 345 | [4-Fluoro-3-(7- morpholin-4-yl- quinazolin-4-yl)- phenyl]pyrrolo[2,1-f]- [1,2,4]triazin-4-yl- methanol1H NMR (500 MHz, DMSO-d6) ppm = 9.09 (s,1H), 8.49 (s, 1H), 8.08 (dd, J = 2.6, 1.4, 1H), 7.84-7.76 (m, 2H), 7.53-7.45 (m, 2H), 7.42-7.36 (m,1H), 7.29 (dd, J = 4.6, 1.4, 1H), 7.19 (d, J = 2.0, 1H),7.02 (dd, J = 4.6, 2.6, 1H), 6.62 (s, 1H), 6.07 (s,1H), 3.80-3.74 (m, 4H), 3.46-3.41 (m, 4H).
Type:
Small organic molecule
Emp. Form.:
C25H21FN6O2
Mol. Mass.:
456.4716
SMILES:
OC(c1ccc(F)c(c1)-c1ncnc2cc(ccc12)N1CCOCC1)c1ncnn2cccc12
: