Target
Potassium voltage-gated channel subfamily H member 2
Ligand
BDBM315965
Substrate
Meas. Tech.
Patch Clamp Assay
Ki
12500±n/a nM
Citation
 Fuchss, TEmde, UBuchstaller, HMederski, W Arylquinazolines US Patent  US9732094 Publication Date 8/15/2017 
Target
Name:
Potassium voltage-gated channel subfamily H member 2
Synonyms:
1,3-beta-glucan synthase component GLS2 ERG Eag-related protein 1 Ether-a-go-go-related gene (HERG) Ether-a-go-go-related gene potassium channel 1 Ether-a-go-go-related gene potassium channel 1 (hERG1) Ether-a-go-go-related protein 1 H-ERG KCNH2 Potassium voltage-gated channel subfamily H member 2 (hERG) Voltage-gated potassium channel subunit Kv11.1 hERG Potassium Channel 1 | putative potassium channel subunit
Type:
Multi-pass membrane protein
Mol. Mass.:
126672.65
Organism:
Homo sapiens (Human)
Description:
Q12809
Residue:
1159
  
Inhibitor
Name:
BDBM315965
Synonyms:
US10172859, Example 388 [4-Fluoro-3-(7- morpholin-4-yl- quinazolin-4-yl)- phenyl]-(5,6,7,8- tetrahydropyrido- [3,4-d}pyrimidin-4-yl)- methanol1H NMR (500 MHz, DMSO-d6) ppm = 9.09 (s,1H), 8.88 (s, 1H), 7.64-7.56 (m, 2H), 7.55-7.50(m, 2H), 7.38 (dd, J = 10.5, 8.1, 1H), 7.23-7.16(m, 1H), 6.20 (d, J = 5.8, 1H), 5.96 (d, J = 5.8, 1H),3.83 (s, 2H), 3.81-3.72 (m, 4H), 3.49-3.39 (m,4H), 3.05-2.84 (m, 2H), 2.77-2.72 (m, 2H).
Type:
Small organic molecule
Emp. Form.:
C26H25FN6O2
Mol. Mass.:
472.5141
SMILES:
OC(c1ccc(F)c(c1)-c1ncnc2cc(ccc12)N1CCOCC1)c1ncnc2CNCCc12
: