Target
Potassium voltage-gated channel subfamily H member 2
Ligand
BDBM315971
Substrate
Meas. Tech.
Patch Clamp Assay
Ki
<10000±n/a nM
Citation
 Fuchss, TEmde, UBuchstaller, HMederski, W Arylquinazolines US Patent  US9732094 Publication Date 8/15/2017 
Target
Name:
Potassium voltage-gated channel subfamily H member 2
Synonyms:
1,3-beta-glucan synthase component GLS2 ERG Eag-related protein 1 Ether-a-go-go-related gene (HERG) Ether-a-go-go-related gene potassium channel 1 Ether-a-go-go-related gene potassium channel 1 (hERG1) Ether-a-go-go-related protein 1 H-ERG KCNH2 Potassium voltage-gated channel subfamily H member 2 (hERG) Voltage-gated potassium channel subunit Kv11.1 hERG Potassium Channel 1 | putative potassium channel subunit
Type:
Multi-pass membrane protein
Mol. Mass.:
126672.65
Organism:
Homo sapiens (Human)
Description:
Q12809
Residue:
1159
  
Inhibitor
Name:
BDBM315971
Synonyms:
US10172859, Example 394 US9732094, Example 394 | [2-Fluoro-5-(7- morpholin-4-yl- quinazolin-4-yl)- phenyl]-(3-methoxy- pyrazin-2-yl)- methanol1H NMR (500 MHz, DMSO-d6) ppm = 9.08 (s,1H), 8.19 (d, J = 2.7, 1H), 8.17 (d, J = 2.7, 1H), 8.07(dd, J = 8.3, 1H), 7.93 (d, J = 9.4, 1H), 7.73(ddd, J = 8.3, 5.0, 2.4, 1H), 7.57 (dd, J = 9.5, 2.6,1H), 7.33 (dd, J = 10.1, 8.4, 1H), 7.22 (d, J = 2.5,1H), 6.35 (d, J = 6.0, 1H), 6.21 (d, J = 6.0, 1H), 3.98(s, 3H), 3.82-3.76 (m, 4H), 3.46 (dd, J = 5.9, 3.9,4H).
Type:
Small organic molecule
Emp. Form.:
C24H22FN5O3
Mol. Mass.:
447.4616
SMILES:
COc1nccnc1C(O)c1cc(ccc1F)-c1ncnc2cc(ccc12)N1CCOCC1
: