Target
Potassium voltage-gated channel subfamily H member 2
Ligand
BDBM315982
Substrate
Meas. Tech.
Patch Clamp Assay
Ki
<10000±n/a nM
Citation
 Fuchss, TEmde, UBuchstaller, HMederski, W Arylquinazolines US Patent  US9732094 Publication Date 8/15/2017 
Target
Name:
Potassium voltage-gated channel subfamily H member 2
Synonyms:
1,3-beta-glucan synthase component GLS2 ERG Eag-related protein 1 Ether-a-go-go-related gene (HERG) Ether-a-go-go-related gene potassium channel 1 Ether-a-go-go-related gene potassium channel 1 (hERG1) Ether-a-go-go-related protein 1 H-ERG KCNH2 Potassium voltage-gated channel subfamily H member 2 (hERG) Voltage-gated potassium channel subunit Kv11.1 hERG Potassium Channel 1 | putative potassium channel subunit
Type:
Multi-pass membrane protein
Mol. Mass.:
126672.65
Organism:
Homo sapiens (Human)
Description:
Q12809
Residue:
1159
  
Inhibitor
Name:
BDBM315982
Synonyms:
US10172859, Example 405 US9732094, Example 405 | [2-Fluoro-5-(7- morpholin-4-yl- quinazolin-4-yl)- phenyl]thieno[3,2-d}- pyrimidin-4-yl- methanol1H NMR (500 MHz, DMSO-d6) ppm = 9.07 (s,1H), 9.04 (s, 1H), 8.49 (d, J = 5.5, 1H), 7.91 (dd,J = 6.9, 2.3, 1H), 7.80 (d, J = 9.4, 1H), 7.79-7.74(m, 1H), 7.63 (d, J = 5.5, 1H), 7.49 (dd, J = 9.5, 2.6,1H), 7.43 (dd, J = 9.9, 8.5, 1H), 7.21-7.15 (m, 2H),6.38 (d, J = 2.1, 1H), 3.83-3.76 (m, 4H), 3.47-3.42 (m, 4H).
Type:
Small organic molecule
Emp. Form.:
C25H20FN5O2S
Mol. Mass.:
473.522
SMILES:
OC(c1cc(ccc1F)-c1ncnc2cc(ccc12)N1CCOCC1)c1ncnc2ccsc12
: