Target
Potassium voltage-gated channel subfamily H member 2
Ligand
BDBM315983
Substrate
Meas. Tech.
Patch Clamp Assay
Ki
12500±n/a nM
Citation
 Fuchss, TEmde, UBuchstaller, HMederski, W Arylquinazolines US Patent  US9732094 Publication Date 8/15/2017 
Target
Name:
Potassium voltage-gated channel subfamily H member 2
Synonyms:
1,3-beta-glucan synthase component GLS2 ERG Eag-related protein 1 Ether-a-go-go-related gene (HERG) Ether-a-go-go-related gene potassium channel 1 Ether-a-go-go-related gene potassium channel 1 (hERG1) Ether-a-go-go-related protein 1 H-ERG KCNH2 Potassium voltage-gated channel subfamily H member 2 (hERG) Voltage-gated potassium channel subunit Kv11.1 hERG Potassium Channel 1 | putative potassium channel subunit
Type:
Multi-pass membrane protein
Mol. Mass.:
126672.65
Organism:
Homo sapiens (Human)
Description:
Q12809
Residue:
1159
  
Inhibitor
Name:
BDBM315983
Synonyms:
US10172859, Example 406 US9732094, Example 406 | [2-Fluoro-5-(7- morpholin-4-yl- quinazolin-4-yl)- phenyl]thieno[2,3-d}- pyrimidin-4-yl- methanol1H NMR (500 MHz, DMSO-d6) ppm = 9.06 (s,1H), 9.03 (s, 1H), 8.48 (d, J = 5.6, 1H), 7.90 (dd,J = 6.9, 2.3, 1H), 7.79 (d, J = 9.4, 1H), 7.78-7.73(m, 1H), 7.62 (d, J = 5.6, 1H), 7.48 (dd, J = 9.5, 2.6,1H), 7.41 (dd, J = 9.9, 8.5, 1H), 7.18 (d, J = 2.6, 1H),7.16 (d, J = 4.7, 1H), 6.36 (d, J = 4.5, 1H), 3.82-3.74 (m, 4H), 3.48-3.40 (m, 4H).
Type:
Small organic molecule
Emp. Form.:
C25H20FN5O2S
Mol. Mass.:
473.522
SMILES:
OC(c1cc(ccc1F)-c1ncnc2cc(ccc12)N1CCOCC1)c1ncnc2sccc12
: