Target
Potassium voltage-gated channel subfamily H member 2
Ligand
BDBM315991
Substrate
Meas. Tech.
Patch Clamp Assay
Ki
12500±n/a nM
Citation
 Fuchss, TEmde, UBuchstaller, HMederski, W Arylquinazolines US Patent  US9732094 Publication Date 8/15/2017 
Target
Name:
Potassium voltage-gated channel subfamily H member 2
Synonyms:
1,3-beta-glucan synthase component GLS2 ERG Eag-related protein 1 Ether-a-go-go-related gene (HERG) Ether-a-go-go-related gene potassium channel 1 Ether-a-go-go-related gene potassium channel 1 (hERG1) Ether-a-go-go-related protein 1 H-ERG KCNH2 Potassium voltage-gated channel subfamily H member 2 (hERG) Voltage-gated potassium channel subunit Kv11.1 hERG Potassium Channel 1 | putative potassium channel subunit
Type:
Multi-pass membrane protein
Mol. Mass.:
126672.65
Organism:
Homo sapiens (Human)
Description:
Q12809
Residue:
1159
  
Inhibitor
Name:
BDBM315991
Synonyms:
US10172859, Example 414 US10172859, Example 432 US9732094, Example 432 | [2-Chloro-5-(7- morpholin-4-yl- quinazolin-4-yl)- phenyl]furo[3,2-d}- pyrimidin-4-yl- methanol (Ena 2)see racemate
Type:
Small organic molecule
Emp. Form.:
C25H20ClN5O3
Mol. Mass.:
473.911
SMILES:
OC(c1cc(ccc1Cl)-c1ncnc2cc(ccc12)N1CCOCC1)c1ncnc2ccoc12
: