Target
Potassium voltage-gated channel subfamily H member 2
Ligand
BDBM315993
Substrate
Meas. Tech.
Patch Clamp Assay
Ki
12500±n/a nM
Citation
 Fuchss, TEmde, UBuchstaller, HMederski, W Arylquinazolines US Patent  US9732094 Publication Date 8/15/2017 
Target
Name:
Potassium voltage-gated channel subfamily H member 2
Synonyms:
1,3-beta-glucan synthase component GLS2 ERG Eag-related protein 1 Ether-a-go-go-related gene (HERG) Ether-a-go-go-related gene potassium channel 1 Ether-a-go-go-related gene potassium channel 1 (hERG1) Ether-a-go-go-related protein 1 H-ERG KCNH2 Potassium voltage-gated channel subfamily H member 2 (hERG) Voltage-gated potassium channel subunit Kv11.1 hERG Potassium Channel 1 | putative potassium channel subunit
Type:
Multi-pass membrane protein
Mol. Mass.:
126672.65
Organism:
Homo sapiens (Human)
Description:
Q12809
Residue:
1159
  
Inhibitor
Name:
BDBM315993
Synonyms:
US10172859, Example 416 US9732094, Example 416 | [2-Chloro-5-(7- morpholin-4-yl- quinazolin-4-yl)- phenyl]furo[2,3-d}- pyrimidin-4-yl- methanol1H NMR (500 MHz, DMSO-d6) ppm = 9.07 (s,1H), 8.88 (s, 1H), 8.20 (d, J = 2.5, 1H), 8.03 (d,J = 2.2, 1H), 7.84 (d, J = 9.4, 1H), 7.72 (dd, J = 8.2,2.2, 1H), 7.65 (d, J = 8.3, 1H), 7.52 (dd, J = 9.4, 2.6,1H), 7.26 (d, J = 2.5, 1H), 7.20 (d, J = 2.5, 1H), 6.88-6.72 (m, 1H), 6.46 (s, 1H), 3.82-3.76 (m, 4H),3.48-3.42 (m, 4H).
Type:
Small organic molecule
Emp. Form.:
C25H20ClN5O3
Mol. Mass.:
473.911
SMILES:
OC(c1cc(ccc1Cl)-c1ncnc2cc(ccc12)N1CCOCC1)c1ncnc2occc12
: