Target
Potassium voltage-gated channel subfamily H member 2
Ligand
BDBM316006
Substrate
Meas. Tech.
Patch Clamp Assay
Ki
<10000±n/a nM
Citation
 Fuchss, TEmde, UBuchstaller, HMederski, W Arylquinazolines US Patent  US9732094 Publication Date 8/15/2017 
Target
Name:
Potassium voltage-gated channel subfamily H member 2
Synonyms:
1,3-beta-glucan synthase component GLS2 ERG Eag-related protein 1 Ether-a-go-go-related gene (HERG) Ether-a-go-go-related gene potassium channel 1 Ether-a-go-go-related gene potassium channel 1 (hERG1) Ether-a-go-go-related protein 1 H-ERG KCNH2 Potassium voltage-gated channel subfamily H member 2 (hERG) Voltage-gated potassium channel subunit Kv11.1 hERG Potassium Channel 1 | putative potassium channel subunit
Type:
Multi-pass membrane protein
Mol. Mass.:
126672.65
Organism:
Homo sapiens (Human)
Description:
Q12809
Residue:
1159
  
Inhibitor
Name:
BDBM316006
Synonyms:
US10172859, Example 429 US9732094, Example 429 | [2-Chloro-4-fluoro-5- (7-morpholin-4-yl- quinazolin-4-yl)- phenyl]thieno[2,3-d}- pyrimidin-4-yl- methanol1H NMR (500 MHz, DMSO-d6) ppm = 9.07 (s,1H), 9.05 (s, 1H), 8.46 (d, J = 5.6, 1H), 7.75 (d,J = 7.6, 1H), 7.72 (d, J = 9.6, 1H), 7.61 (d, J = 5.6,1H), 7.55-7.49 (m, 2H), 7.20 (d, J = 5.0, 1H), 7.19-7.17 (m, 1H), 6.42 (d, J = 5.1, 1H), 3.80-3.75 (m,4H), 3.46-3.42 (m, 4H).
Type:
Small organic molecule
Emp. Form.:
C25H19ClFN5O2S
Mol. Mass.:
507.967
SMILES:
OC(c1cc(c(F)cc1Cl)-c1ncnc2cc(ccc12)N1CCOCC1)c1ncnc2sccc12
: