Target
Potassium voltage-gated channel subfamily H member 2
Ligand
BDBM316024
Substrate
Meas. Tech.
Patch Clamp Assay
Ki
12500±n/a nM
Citation
 Fuchss, TEmde, UBuchstaller, HMederski, W Arylquinazolines US Patent  US9732094 Publication Date 8/15/2017 
Target
Name:
Potassium voltage-gated channel subfamily H member 2
Synonyms:
1,3-beta-glucan synthase component GLS2 ERG Eag-related protein 1 Ether-a-go-go-related gene (HERG) Ether-a-go-go-related gene potassium channel 1 Ether-a-go-go-related gene potassium channel 1 (hERG1) Ether-a-go-go-related protein 1 H-ERG KCNH2 Potassium voltage-gated channel subfamily H member 2 (hERG) Voltage-gated potassium channel subunit Kv11.1 hERG Potassium Channel 1 | putative potassium channel subunit
Type:
Multi-pass membrane protein
Mol. Mass.:
126672.65
Organism:
Homo sapiens (Human)
Description:
Q12809
Residue:
1159
  
Inhibitor
Name:
BDBM316024
Synonyms:
US10172859, Example 447 US9732094, Example 447 | [2-Chloro-4-fluoro-5- (7-morpholin-4-yl- quinazolin-4-yl)- phenyl]-(5-methoxy- pyrimidin-4-yl)- methanol1H NMR (400 MHz, DMSO-d6) ppm = 9.14 (s,1H), 8.74 (s, 1H), 8.65 (s, 1H), 7.97 (d, J = 7.9,1H), 7.69-7.52 (m, 3H), 7.23 (d, J = 2.4, 1H), 6.43-6.32 (m, 2H), 4.01 (s, 3H), 3.80 (dd, J = 5.9, 3.9,4H), 3.47 (t, J = 4.9, 4H).
Type:
Small organic molecule
Emp. Form.:
C24H21ClFN5O3
Mol. Mass.:
481.907
SMILES:
COc1cncnc1C(O)c1cc(c(F)cc1Cl)-c1ncnc2cc(ccc12)N1CCOCC1
: