Target
Potassium voltage-gated channel subfamily H member 2
Ligand
BDBM316056
Substrate
Meas. Tech.
Patch Clamp Assay
Ki
<10000±n/a nM
Citation
 Fuchss, TEmde, UBuchstaller, HMederski, W Arylquinazolines US Patent  US9732094 Publication Date 8/15/2017 
Target
Name:
Potassium voltage-gated channel subfamily H member 2
Synonyms:
1,3-beta-glucan synthase component GLS2 ERG Eag-related protein 1 Ether-a-go-go-related gene (HERG) Ether-a-go-go-related gene potassium channel 1 Ether-a-go-go-related gene potassium channel 1 (hERG1) Ether-a-go-go-related protein 1 H-ERG KCNH2 Potassium voltage-gated channel subfamily H member 2 (hERG) Voltage-gated potassium channel subunit Kv11.1 hERG Potassium Channel 1 | putative potassium channel subunit
Type:
Multi-pass membrane protein
Mol. Mass.:
126672.65
Organism:
Homo sapiens (Human)
Description:
Q12809
Residue:
1159
  
Inhibitor
Name:
BDBM316056
Synonyms:
(3-bromo-pyridin-2- yl)-[4-fluoro-3-(7- morpholin-4-yl- quinazolin-4-yl)- phenyl]methanol1H NMR (400 MHz, DMSO-d6) ppm = 9.09 (s,1H), 8.60 (dd, J = 4.6, 1.4, 1H), 8.08 (dd, J = 8.1,1.5, 1H), 7.65-7.59 (m, 2H), 7.54-7.50 (m, 2H),7.41-7.34 (m, 1H), 7.29 (dd, J = 8.1, 4.6, 1H),7.21-7.18 (m, 1H), 6.20 (d, J = 6.3, 1H), 6.12 (d,J = 6.3, 1H), 3.82-3.74 (m, 4H), 3.49-3.40 (m,4H). US11065253, Example 478 | US9732094, Example 478
Type:
Small organic molecule
Emp. Form.:
C24H20BrFN4O2
Mol. Mass.:
495.344
SMILES:
OC(c1ccc(F)c(c1)-c1ncnc2cc(ccc12)N1CCOCC1)c1ncccc1Br
: