Target
Epidermal growth factor receptor [T790M,L858R]
Ligand
BDBM200548
Substrate
Meas. Tech.
TBD
IC50
0.210±n/a nM
Citation
 Zhou, CZhang, G Fused tricyclic amide compounds as multiple kinase inhibitors US Patent  US9670231 Publication Date 6/6/2017 
Target
Name:
Epidermal growth factor receptor [T790M,L858R]
Synonyms:
EGFR EGFR_HUMAN ERBB1 Epidermal growth factor receptor (EGFR)(T790M/L858R) Epidermal growth factor receptor (T790M, L858R) Epidermal growth factor receptor(L858R, T790M) | HER1
Type:
Mol. Mass.:
134353.72
Organism:
Homo sapiens (Human)
Description:
P00533[T790M,L858R]
Residue:
1210
  
Inhibitor
Name:
BDBM200548
Synonyms:
US9670231, 1.51
Type:
Small organic molecule
Emp. Form.:
C31H29F3N4O5
Mol. Mass.:
594.581
SMILES:
CN1CCC(CC1)Oc1ccc(cc1C(F)(F)F)C(=O)N[C@@H]1[C@H]2Oc3ccc(Oc4ccnc5NC(=O)CCc45)cc3[C@@H]12
: