Target
Epidermal growth factor receptor [T790M,L858R]
Ligand
BDBM200795
Substrate
Meas. Tech.
TBD
IC50
0.180±n/a nM
Citation
 Zhou, CZhang, G Fused tricyclic amide compounds as multiple kinase inhibitors US Patent  US9670231 Publication Date 6/6/2017 
Target
Name:
Epidermal growth factor receptor [T790M,L858R]
Synonyms:
EGFR EGFR_HUMAN ERBB1 Epidermal growth factor receptor (EGFR)(T790M/L858R) Epidermal growth factor receptor (T790M, L858R) Epidermal growth factor receptor(L858R, T790M) | HER1
Type:
Mol. Mass.:
134353.72
Organism:
Homo sapiens (Human)
Description:
P00533[T790M,L858R]
Residue:
1210
  
Inhibitor
Name:
BDBM200795
Synonyms:
US9670231, 1.75
Type:
Small organic molecule
Emp. Form.:
C33H31F3N4O4
Mol. Mass.:
604.6188
SMILES:
[#6]-[#6]-[#7]-1-[#6]-[#6]\[#6](-[#6]-[#6]-1)=[#6]/c1ccc(cc1C(F)(F)F)-[#6](=O)-[#7]-[#6@@H]-1-[#6@H]-2-[#8]-c3ccc(-[#8]-c4ccnc5-[#7]-[#6](=O)-[#6]-[#6]-c45)cc3-[#6@@H]-1-2
: