Target
Epidermal growth factor receptor [T790M,L858R]
Ligand
BDBM200810
Substrate
Meas. Tech.
TBD
IC50
0.084±n/a nM
Citation
 Zhou, CZhang, G Fused tricyclic amide compounds as multiple kinase inhibitors US Patent  US9670231 Publication Date 6/6/2017 
Target
Name:
Epidermal growth factor receptor [T790M,L858R]
Synonyms:
EGFR EGFR_HUMAN ERBB1 Epidermal growth factor receptor (EGFR)(T790M/L858R) Epidermal growth factor receptor (T790M, L858R) Epidermal growth factor receptor(L858R, T790M) | HER1
Type:
Mol. Mass.:
134353.72
Organism:
Homo sapiens (Human)
Description:
P00533[T790M,L858R]
Residue:
1210
  
Inhibitor
Name:
BDBM200810
Synonyms:
US9670231, 2.7
Type:
Small organic molecule
Emp. Form.:
C30H29F3N6O4
Mol. Mass.:
594.5843
SMILES:
CN1CCN(Cc2ccc(cc2C(F)(F)F)C(=O)N[C@@H]2[C@H]3Oc4ccc(Oc5ccnc6NC(=O)NCc56)cc4[C@@H]23)CC1
: