Target
NAD-dependent protein deacetylase sirtuin-2
Ligand
BDBM335558
Substrate
Meas. Tech.
Biochemical Deacetylation Assay
IC50
750±n/a nM
Citation
 Kazantsev, AGThompson, LMAbagyan, RCasale, M Small molecule activators of NRF2 pathway US Patent  US9737525 Publication Date 8/22/2017 
Target
Name:
NAD-dependent protein deacetylase sirtuin-2
Synonyms:
NAD-Dependent Deacetylase Sirtuin-2 NAD-dependent deacetylase sirtuin 3 SIR2-like SIR2L SIR2_HUMAN Sirtuin 2 (SIRT2)
Type:
Hydrolase
Mol. Mass.:
43172.62
Organism:
Homo sapiens (Human)
Description:
Residue:
389
  
Inhibitor
Name:
BDBM335558
Synonyms:
US9737525, Compound MIND4-17-56
Type:
Small organic molecule
Emp. Form.:
C19H11BrClN5O2S
Mol. Mass.:
488.745
SMILES:
[O-][N+](=O)c1cnc(Sc2nnc(-c3ccc(Cl)cc3)n2-c2ccccc2)c(Br)c1
: