Target
AP2-associated protein kinase 1
Ligand
BDBM335638
Substrate
Meas. Tech.
Kinase Assay
IC50
384±n/a nM
Citation
 Dzierba, CDDasgupta, BMacor, JEBronson, JJRajamani, RKarageorge, GN Pyrrolotriazine kinase inhibitors US Patent  US9737542 Publication Date 8/22/2017 
Target
Name:
AP2-associated protein kinase 1
Synonyms:
AAK1 Adaptor-associated kinase 1 | KIAA1048
Type:
PROTEIN
Mol. Mass.:
103884.23
Organism:
Homo sapiens (Human)
Description:
ChEMBL_774569
Residue:
961
  
Inhibitor
Name:
BDBM335638
Synonyms:
N-(3-(5-isopropyl-1,3,4-oxadiazol-2-yl)phenyl)pyrrolo[2,1-f][1,2,4]triazin-4-amine | US9737542, Example 80
Type:
Small organic molecule
Emp. Form.:
C17H16N6O
Mol. Mass.:
320.3485
SMILES:
CC(C)c1nnc(o1)-c1cccc(Nc2ncnn3cccc23)c1
: