Target
Amyloid beta-binding alcohol dehydrogenase
Ligand
BDBM232925
Substrate
Meas. Tech.
Assay of ABAD Enzymatic Activity
Ki
44900±n/a nM
Citation
 Yan, SValasani, KR Phosphonate derivatives and methods of use thereof in the treatment of Alzheimer's disease US Patent  US9738668 Publication Date 8/22/2017 
Target
Name:
Amyloid beta-binding alcohol dehydrogenase
Synonyms:
Amyloid beta-binding alcohol dehydrogenase (ABAD)
Type:
Enzyme
Mol. Mass.:
938.17
Organism:
Homo sapiens (Human)
Description:
Q2L8D9
Residue:
9
MAAACRSVK
  
Inhibitor
Name:
BDBM232925
Synonyms:
US9346839, 6 | US9738668, Compound 6
Type:
Small organic molecule
Emp. Form.:
C21H25N2O7PS
Mol. Mass.:
480.471
SMILES:
CCOP(=O)(OCC)[C@@H](Nc1nc2cc(OC)ccc2s1)c1ccc(O)c(c1)C(=O)OC
: